{"text_format":"1","workbook":"xlsx","n_sheets":4,"sheets":["Solicitud","Salida_Solicitud","PARAMETROS","Validaciones"],"not_rendered":{"charts":0,"images":1,"macros":1,"external_links":0,"defined_names":1,"comments":0,"pivot_tables":0},"unopened":[],"bounds":{"document_bytes":16777216,"sheet_cells":100000,"rows_first":2000,"rows_last":500,"rows_between":2000,"halvings":0,"cell_chars":16384,"cell_head_chars":4096},"cells_cut":0,"cells_raw":0,"read":"whole","date_system":"1900"}

{"sheet":"Solicitud","index":0,"n_rows":544,"n_cols":9,"rows_kept":544,"cut":false,"hidden":false,"merged":[[42,2,42,7],[3,2,4,8]]}
[]
[]
[]
[null,null,"Ingrese los datos de Cotización"]
[]
[null,"Cantidad Reg act",{"$f":"I42","v":0},null,"Check general","Contador v2","Fecha","2021-05-31"]
[null,null,null,null,null,{"$f":"IF(E9>30000000,IF(COUNTIF(F9:F32,\"=ok\")>=7,\"ok\",\"\"),IF(COUNTIF(F9:F32,\"=ok\")=9,\"ok\",\"\"))","v":""}]
[null,null,"1. CONTRATANTE / EMPLEADOR",null,null,"Check",null,"precio final"]
[null,null,"RUT (SIN PUNTOS,SIN DV)",null,null,{"$f":"IF(dvrut(G25)=\"Incorrecto\", \"Rut o DV incorrecto\",\"ok\")","v":"Rut o DV incorrecto"}]
[null,null,"DIGITO VERIFICADOR",null,null,{"$f":"IF(E10=\"\",\"Favor completar datos\",\"ok\")","v":"Favor completar datos"}]
[null,null,"NOMBRE/RAZON SOCIAL",null,null,{"$f":"IF(E11=\"\",\"Favor completar datos\",\"ok\")","v":"Favor completar datos"}]
[null,null,"APELLIDO PATERNO",null,null,{"$f":"IF(E9>50000000,\"\",IF(E12=\"\",\"Favor completar datos\",\"ok\"))","v":"Favor completar datos"}]
[null,null,"APELLIDO MATERNO",null,null,{"$f":"IF(E9>50000000,\"\",IF(E13=\"\",\"Favor completar datos\",\"ok\"))","v":"Favor completar datos"}]
[null,null,"CALLE / DIRECCIÓN",null,null,{"$f":"IF(E14=\"\",\"Favor completar datos\",\"ok\")","v":"Favor completar datos"}]
[null,null,"COMUNA",null,null,{"$f":"IF(E15=\"\",\"Favor completar datos\",\"ok\")","v":"Favor completar datos"}]
[null,null,"E-MAIL CONTRATANTE",null,null,{"$f":"IF(E16=\"\",\"Favor completar datos\",\"ok\")","v":"Favor completar datos"}]
[]
[]
[null,null,null,null,null,null,"<- quitar"]
[]
[null,null,null,null,null,null,{"$f":"Validaciones!C35","v":-44357}]
[]
[]
[]
[null,null,null,null,null,null,{"$f":"_xlfn.CONCAT(E9,\"-\",E10)","v":"-"}]
[null,null,"2.TARIFA"]
[null,null,"TARIFA NETA UNITARIA UF",null,{"$f":"Validaciones!K40","v":0.38700000000000001}]
[null,null,"TARIFA FINAL (BRUTA) UF",null,{"$f":"ROUND((E27*0.57*1.19),3)+ROUND(E27*(1-0.57),3)","v":0.42900000000000005}]
[]
[null,null,"3.OTROS"]
[null,null,"FECHA DE INICIO",null,null,{"$f":"IF(AND(E31<>\"\",G21<0),\"Fecha invalida\",IF(G21>10,\"Revisar Inicio vigencia\",IF(E31=\"\",\"Favor completar datos\",\"ok\")))","v":"Favor completar datos"}]
[null,null,"FECHA DE TERMINO",null,{"$f":"IF(E31=\"\",\"\",E31+365)","v":""}]
[]
[null,null,"CANTIDAD DE ASEGURADOS",null,{"$f":"COUNTIF(I45:I544,\"Ok\")","v":0}]
[null,null,"PRIMA TOTAL A PAGAR UF",null,{"$f":"COUNTIF(I45:I544,\"Ok\")*E28","v":0}]
[null,null,"PRIMA TOTAL A TRANSFERIR $",null,{"$f":"IFERROR(ROUND(E35*VLOOKUP(E31,PARAMETROS!M:N,2,1),0),\"\")","v":""}]
[]
[null,null,null,null,{"$f":"IF(AND(F7=\"ok\",I43=\"ok\"), \"Formulario apto para ser enviado\", \"Revisar Validaciones\")","v":"Revisar Validaciones"}]
[]
[]
[]
[null,null,null,null,null,null,null,null,{"$f":"COUNTIF(I44:I93,\"=ok\")","v":0}]
[null,null,"ASEGURADO MULTIPLES",null,null,null,null,null,{"$f":"IF(AND(COUNTIF(I45:I144,\"=Datos erroneos o incompletos\")=0,COUNTIF(I45:I144,\"=ok\")>0),\"ok\",\"Revisar datos\")","v":"Revisar datos"}]
[null,"Check Rut","RUT","DV","Nombre","Apellido Paterno","Apellido Materno","Email Asegurado (Opcional)","Check Datos"]
[{"$f":"IF(C45<>\"\",_xlfn.CONCAT(C45,\"-\",D45),\"\")","v":""},{"$f":"IF(C45<>\"\",IF(dvrut(A45)=\"Incorrecto\", \"Rut o DV incorrecto\",\"ok\"),\"\")","v":""},null,null,null,null,null,null,{"$f":"IF(C45=\"\",\"\",IF(AND(C45=\"\",D45=\"\",E45=\"\",F45=\"\",G45=\"\"),\"Completar datos\",IF(AND(B45=\"ok\",C45<>\"\",D45<>\"\",E45<>\"\",F45<>\"\",G45<>\"\"),\"ok\",\"Datos erroneos o incompletos\")))","v":""}]
["",{"$f":"IF(C46<>\"\",IF(dvrut(A46)=\"Incorrecto\", \"Rut o DV incorrecto\",\"ok\"),\"\")","v":""},null,null,null,null,null,null,{"$f":"IF(C46=\"\",\"\",IF(AND(C46=\"\",D46=\"\",E46=\"\",F46=\"\",G46=\"\"),\"Completar datos\",IF(AND(B46=\"ok\",C46<>\"\",D46<>\"\",E46<>\"\",F46<>\"\",G46<>\"\"),\"ok\",\"Datos erroneos o incompletos\")))","v":""}]
["",{"$f":"IF(C47<>\"\",IF(dvrut(A47)=\"Incorrecto\", \"Rut o DV incorrecto\",\"ok\"),\"\")","v":""},null,null,null,null,null,null,""]
["",{"$f":"IF(C48<>\"\",IF(dvrut(A48)=\"Incorrecto\", \"Rut o DV incorrecto\",\"ok\"),\"\")","v":""},null,null,null,null,null,null,""]
["",{"$f":"IF(C49<>\"\",IF(dvrut(A49)=\"Incorrecto\", \"Rut o DV incorrecto\",\"ok\"),\"\")","v":""},null,null,null,null,null,null,""]
["",{"$f":"IF(C50<>\"\",IF(dvrut(A50)=\"Incorrecto\", \"Rut o DV incorrecto\",\"ok\"),\"\")","v":""},null,null,null,null,null,null,""]
["",{"$f":"IF(C51<>\"\",IF(dvrut(A51)=\"Incorrecto\", \"Rut o DV incorrecto\",\"ok\"),\"\")","v":""},null,null,null,null,null,null,""]
["",{"$f":"IF(C52<>\"\",IF(dvrut(A52)=\"Incorrecto\", \"Rut o DV incorrecto\",\"ok\"),\"\")","v":""},null,null,null,null,null,null,""]
["",{"$f":"IF(C53<>\"\",IF(dvrut(A53)=\"Incorrecto\", \"Rut o DV incorrecto\",\"ok\"),\"\")","v":""},null,null,null,null,null,null,""]
["",{"$f":"IF(C54<>\"\",IF(dvrut(A54)=\"Incorrecto\", \"Rut o DV incorrecto\",\"ok\"),\"\")","v":""},null,null,null,null,null,null,""]
["",{"$f":"IF(C55<>\"\",IF(dvrut(A55)=\"Incorrecto\", \"Rut o DV incorrecto\",\"ok\"),\"\")","v":""},null,null,null,null,null,null,""]
["",{"$f":"IF(C56<>\"\",IF(dvrut(A56)=\"Incorrecto\", \"Rut o DV incorrecto\",\"ok\"),\"\")","v":""},null,null,null,null,null,null,""]
["",{"$f":"IF(C57<>\"\",IF(dvrut(A57)=\"Incorrecto\", \"Rut o DV incorrecto\",\"ok\"),\"\")","v":""},null,null,null,null,null,null,""]
["",{"$f":"IF(C58<>\"\",IF(dvrut(A58)=\"Incorrecto\", \"Rut o DV incorrecto\",\"ok\"),\"\")","v":""},null,null,null,null,null,null,""]
["",{"$f":"IF(C59<>\"\",IF(dvrut(A59)=\"Incorrecto\", \"Rut o DV incorrecto\",\"ok\"),\"\")","v":""},null,null,null,null,null,null,""]
["",{"$f":"IF(C60<>\"\",IF(dvrut(A60)=\"Incorrecto\", \"Rut o DV incorrecto\",\"ok\"),\"\")","v":""},null,null,null,null,null,null,""]
["",{"$f":"IF(C61<>\"\",IF(dvrut(A61)=\"Incorrecto\", \"Rut o DV incorrecto\",\"ok\"),\"\")","v":""},null,null,null,null,null,null,""]
["",{"$f":"IF(C62<>\"\",IF(dvrut(A62)=\"Incorrecto\", \"Rut o DV incorrecto\",\"ok\"),\"\")","v":""},null,null,null,null,null,null,""]
["",{"$f":"IF(C63<>\"\",IF(dvrut(A63)=\"Incorrecto\", \"Rut o DV incorrecto\",\"ok\"),\"\")","v":""},null,null,null,null,null,null,""]
["",{"$f":"IF(C64<>\"\",IF(dvrut(A64)=\"Incorrecto\", \"Rut o DV incorrecto\",\"ok\"),\"\")","v":""},null,null,null,null,null,null,""]
["",{"$f":"IF(C65<>\"\",IF(dvrut(A65)=\"Incorrecto\", \"Rut o DV incorrecto\",\"ok\"),\"\")","v":""},null,null,null,null,null,null,""]
["",{"$f":"IF(C66<>\"\",IF(dvrut(A66)=\"Incorrecto\", \"Rut o DV incorrecto\",\"ok\"),\"\")","v":""},null,null,null,null,null,null,""]
["",{"$f":"IF(C67<>\"\",IF(dvrut(A67)=\"Incorrecto\", \"Rut o DV incorrecto\",\"ok\"),\"\")","v":""},null,null,null,null,null,null,""]
["",{"$f":"IF(C68<>\"\",IF(dvrut(A68)=\"Incorrecto\", \"Rut o DV incorrecto\",\"ok\"),\"\")","v":""},null,null,null,null,null,null,""]
["",{"$f":"IF(C69<>\"\",IF(dvrut(A69)=\"Incorrecto\", \"Rut o DV incorrecto\",\"ok\"),\"\")","v":""},null,null,null,null,null,null,""]
["",{"$f":"IF(C70<>\"\",IF(dvrut(A70)=\"Incorrecto\", \"Rut o DV incorrecto\",\"ok\"),\"\")","v":""},null,null,null,null,null,null,""]
["",{"$f":"IF(C71<>\"\",IF(dvrut(A71)=\"Incorrecto\", \"Rut o DV incorrecto\",\"ok\"),\"\")","v":""},null,null,null,null,null,null,""]
["",{"$f":"IF(C72<>\"\",IF(dvrut(A72)=\"Incorrecto\", \"Rut o DV incorrecto\",\"ok\"),\"\")","v":""},null,null,null,null,null,null,""]
["",{"$f":"IF(C73<>\"\",IF(dvrut(A73)=\"Incorrecto\", \"Rut o DV incorrecto\",\"ok\"),\"\")","v":""},null,null,null,null,null,null,""]
["",{"$f":"IF(C74<>\"\",IF(dvrut(A74)=\"Incorrecto\", \"Rut o DV incorrecto\",\"ok\"),\"\")","v":""},null,null,null,null,null,null,""]
["",{"$f":"IF(C75<>\"\",IF(dvrut(A75)=\"Incorrecto\", \"Rut o DV incorrecto\",\"ok\"),\"\")","v":""},null,null,null,null,null,null,""]
["",{"$f":"IF(C76<>\"\",IF(dvrut(A76)=\"Incorrecto\", \"Rut o DV incorrecto\",\"ok\"),\"\")","v":""},null,null,null,null,null,null,""]
[{"$f":"IF(C77<>\"\",_xlfn.CONCAT(C77,\"-\",D77),\"\")","v":""},{"$f":"IF(C77<>\"\",IF(dvrut(A77)=\"Incorrecto\", \"Rut o DV incorrecto\",\"ok\"),\"\")","v":""},null,null,null,null,null,null,""]
["",{"$f":"IF(C78<>\"\",IF(dvrut(A78)=\"Incorrecto\", \"Rut o DV incorrecto\",\"ok\"),\"\")","v":""},null,null,null,null,null,null,""]
["",{"$f":"IF(C79<>\"\",IF(dvrut(A79)=\"Incorrecto\", \"Rut o DV incorrecto\",\"ok\"),\"\")","v":""},null,null,null,null,null,null,""]
["",{"$f":"IF(C80<>\"\",IF(dvrut(A80)=\"Incorrecto\", \"Rut o DV incorrecto\",\"ok\"),\"\")","v":""},null,null,null,null,null,null,""]
{"$rows_left_out":465}
{"sheet":"Salida_Solicitud","index":1,"n_rows":144,"n_cols":9,"rows_kept":144,"cut":false,"hidden":true,"merged":[[3,2,4,8],[42,2,42,7]]}
[]
[]
[]
[null,null,"Ingrese los datos de Cotización"]
[]
[null,"Cantidad Reg act",0,null,"Check general","Contador v2","Fecha","2021-05-31"]
[null,null,null,null,null,""]
[null,null,"1. CONTRATANTE / EMPLEADOR",null,null,null,null,"precio final"]
[null,null,"RUT (SIN PUNTOS,SIN DV)"]
[null,null,"DIGITO VERIFICADOR"]
[null,null,"NOMBRE/RAZON SOCIAL"]
[null,null,"APELLIDO PATERNO"]
[null,null,"APELLIDO MATERNO"]
[null,null,"CALLE / DIRECCIÓN"]
[null,null,"COMUNA"]
[null,null,"E-MAIL CONTRATANTE"]
[]
[]
[]
[]
[]
[]
[]
[]
[null,null,null,null,null,null,"-"]
[null,null,"2.TARIFA"]
[null,null,"TARIFA NETA UNITARIA UF"]
[null,null,"TARIFA FINAL (BRUTA) UF"]
[]
[null,null,"3.OTROS"]
[null,null,"FECHA DE INICIO"]
[null,null,"FECHA DE TERMINO"]
[]
[null,null,"CANTIDAD DE ASEGURADOS"]
[null,null,"PRIMA TOTAL A PAGAR UF"]
[null,null,"PRIMA TOTAL A TRANSFERIR $"]
[]
[null,null,"CODIGO DE SOLICITUD"]
[]
[]
[]
[null,null,null,null,null,null,null,null,0]
[null,null,"ASEGURADO MULTIPLES"]
[null,null,"RUT","DV","Nombre","Apellido Paterno","Apellido Materno","Email Asegurado"]
[""]
[""]
[""]
[""]
[""]
[""]
[""]
[""]
[""]
[""]
[""]
[""]
[""]
[""]
[""]
[""]
[""]
[""]
[""]
[""]
[""]
[""]
[""]
[""]
[""]
[""]
[""]
[""]
[""]
[""]
[""]
[""]
[""]
[""]
[""]
[""]
{"$rows_left_out":65}
{"sheet":"PARAMETROS","index":2,"n_rows":2151,"n_cols":14,"rows_kept":2151,"cut":false,"hidden":true,"merged":[]}
["COMUNA",null,"Codigo de Formulario",null,"Comisiones",null,null,"Codigo Intermediario","Intermediario","CODIGO DE SUCURSAL","Sucursal",null,"FECHA","VALOR UF"]
[null,null,1,null,0,null,null,null,"SERVICIO AL CLIENTE",23,"HDI.CL",null,"2021-06-01",29617.07]
[null,null,null,null,0.01,null,null,1002,"DIRECTO ANTOFAGASTA",3,"Antofagasta",null,{"$f":"M2+1","v":"2021-06-02"},29620.880000000001]
[null,null,null,null,0.02,null,null,1011,"DIRECTO LA FLORIDA",15,"HDI Santiago",null,{"$f":"M3+1","v":"2021-06-03"},29624.7]
[null,null,null,null,0.03,null,null,499,"PALMA ROSSEL,HECTOR MANUEL",1,"Advance",null,"2021-06-04",29628.51]
[null,null,null,null,0.04,null,null,500,"CERDA MUNOZ,LEONARDO PATRICIO",1,"Advance",null,"2021-06-05",29632.33]
[null,null,null,null,0.05,null,null,504,"MELA FARIAS,PATRICIA",1,"Advance",null,"2021-06-06",29636.15]
[null,null,null,null,{"$f":"E7+0.01","v":6.0000000000000005E-2},null,null,22,"ROTHENBURG VILLEGAS,GRETEL",1,"Advance",null,"2021-06-07",29639.96]
[null,null,null,null,{"$f":"E8+0.01","v":7.0000000000000007E-2},null,null,3,"QUIROZ LARREA,ARACELI ERNESTINA",1,"Advance",null,"2021-06-08",29643.78]
[null,null,null,null,0.08,null,null,40,"TORRES VIVANCO,GLORIA ELSA",1,"Advance",null,"2021-06-09",29647.599999999999]
[null,null,null,null,0.09,null,null,5,"VILLAGRAN NORAMBUENA,ERWIN WILSON",7,"Temuco",null,"2021-06-10",29650.560000000001]
[null,null,null,null,9.9999999999999992E-2,null,null,3343,"CALISTO SILVA,JOSE ORLANDO",9,"Puerto Montt",null,"2021-06-11",29653.52]
[null,null,null,null,null,null,null,7003,"ROTHENBURG VILLEGAS,GRETEL",1,"Advance",null,"2021-06-12",29656.48]
[null,null,null,null,null,null,null,3477,"MORENO OYARZUN,ANA XIMENA",31,"HDI Club",null,"2021-06-13",29659.439999999999]
[null,null,null,null,null,null,null,3718,"GONZALEZ SILVA,CARLOS ELIAS",4,"Viña del Mar",null,"2021-06-14",29662.41]
[null,null,null,null,null,null,null,3844,"ARRIOLA CORTEZ,NELLY DEL CARMEN",4,"Viña del Mar",null,"2021-06-15",29665.37]
[null,null,null,null,null,null,null,3228,"VERDUGO CAMPOS,ANA LUISA",31,"HDI Club",null,"2021-06-16",29668.33]
[null,null,null,null,null,null,null,4071,"CUMSILLE PIDDO,CARMEN GLORIA",41,"Rancagua",null,"2021-06-17",29671.29]
[null,null,null,null,null,null,null,4001,"CORNEJO HOFMANN,ANA MARIA",15,"HDI Santiago",null,"2021-06-18",29674.25]
[null,null,null,null,null,null,null,3561,"OJEDA ULLOA,JAIME ENRIQUE",15,"HDI Santiago",null,"2021-06-19",29677.22]
[null,null,null,null,null,null,null,2489,"CESAR VALLEJO MARTINOLLI Y CIA. LTDA.",1,"Advance",null,"2021-06-20",29680.18]
[null,null,null,null,null,null,null,3441,"BORDACHAR HENNING,DOMINGO ALFREDO",31,"HDI Club",null,"2021-06-21",29683.15]
[null,null,null,null,null,null,null,4313,"HERRERA MENDEZ,GASTON ANDRES",6,"Concepción",null,"2021-06-22",29686.11]
[null,null,null,null,null,null,null,3274,"MOREY LAZO,PEDRO JOSE",31,"HDI Club",null,"2021-06-23",29689.07]
[null,null,null,null,null,null,null,4057,"MOLL SUREDA,MARIA ELVIRA",3,"Antofagasta",null,"2021-06-24",29692.04]
[null,null,null,null,null,null,null,3720,"MOTTA YANEZ,ELIZABETH BERTA",2,"Iquique",null,"2021-06-25",29695]
[null,null,null,null,null,null,null,3973,"EDWARDS EDWARDS,JOSE MANUEL",53,"Partners",null,"2021-06-26",29697.97]
[null,null,null,null,null,null,null,3332,"JEREZ LAGOS,FERNANDO",31,"HDI Club",null,"2021-06-27",29700.93]
[null,null,null,null,null,null,null,3215,"VERCELLINO VRANCKEN,LUCIA ADELAIDA",31,"HDI Club",null,"2021-06-28",29703.9]
[null,null,null,null,null,null,null,3715,"POBLETE ROJAS,HERNAN",15,"HDI Santiago",null,"2021-06-29",29706.87]
[null,null,null,null,null,null,null,4449,"ANDRES TOLEDO,ARISTEO DOMINGO",15,"HDI Santiago",null,"2021-06-30",29709.83]
[null,null,null,null,null,null,null,3140,"PEREZ GARCIA,CARLOS JOAQUIN",31,"HDI Club",null,{"$f":"M31+1","v":"2021-07-01"},29712.799999999999]
[null,null,null,null,null,null,null,4264,"MONTENEGRO VERA,OMAR",45,"Osorno",null,"2021-07-02",29715.77]
[null,null,null,null,null,null,null,3724,"LLOYD ROCHA,NORA ROSA",2,"Iquique",null,{"$f":"M33+1","v":"2021-07-03"},29718.73]
[null,null,null,null,null,null,null,4195,"CORREA BRITO,HECTOR RAUL",4,"Viña del Mar",null,"2021-07-04",29721.7]
[null,null,null,null,null,null,null,4247,"TEKE PIERA,MIGUEL ALEJANDRO",9,"Puerto Montt",null,"2021-07-05",29724.67]
[null,null,null,null,null,null,null,3773,"BOHN SAUTEREL,BERTHOLD ERWIN",7,"Temuco",null,"2021-07-06",29727.64]
[null,null,null,null,null,null,null,3368,"ALDUNATE BOSSAY,CLIMENE MARIA",31,"HDI Club",null,"2021-07-07",29730.6]
[null,null,null,null,null,null,null,3862,"GONZALEZ VALDIVIA,MANUEL ASVILDO",2,"Iquique",null,"2021-07-08",29733.57]
[null,null,null,null,null,null,null,3900,"SIPPA OYARCE,GLADYS CECILIA",3,"Antofagasta",null,"2021-07-09",29736.54]
[null,null,null,null,null,null,null,4429,"SALINAS JIMENEZ,PABLO",17,"La Serena",null,{"$f":"M40+1","v":"2021-07-10"}]
[null,null,null,null,null,null,null,3207,"ZAMORA TORRES,LAUTARO DANIEL",41,"Rancagua",null,"2021-07-11"]
[null,null,null,null,null,null,null,4404,"PULGAR ROJAS,DAVID ORLANDO",80,"HDI Comercial",null,"2021-07-12"]
[null,null,null,null,null,null,null,4070,"BARBE ILIC,EDUARDO ALBERTO",15,"HDI Santiago",null,"2021-07-13"]
[null,null,null,null,null,null,null,3405,"TORRES ISLA,ANA AURORA",7,"Temuco",null,"2021-07-14"]
[null,null,null,null,null,null,null,3918,"SILVA KRAEMER,CESAR CARLOS",3,"Antofagasta",null,"2021-07-15"]
[null,null,null,null,null,null,null,3993,"ZLATAR CAMPILLAY,BLAS GREGORIO",3,"Antofagasta",null,"2021-07-16"]
[null,null,null,null,null,null,null,4401,"BUSTAMANTE VIDELA,ROGELIO SEGUNDO",6,"Concepción",null,"2021-07-17"]
[null,null,null,null,null,null,null,3421,"ARIAS ANTIVILO,ANDRES FERNANDO",3,"Antofagasta",null,"2021-07-18"]
[null,null,null,null,null,null,null,3825,"VELASQUEZ SALAH,ANTONIO SEGUNDO",31,"HDI Club",null,"2021-07-19"]
[null,null,null,null,null,null,null,4357,"ACORIA OLMOS,BERNARDO",15,"HDI Santiago",null,"2021-07-20"]
[null,null,null,null,null,null,null,4133,"RECABARREN PONCE,MARTA BEATRIZ",31,"HDI Club",null,"2021-07-21"]
[null,null,null,null,null,null,null,4108,"GONZALEZ REBOLLEDO,PEDRO VICENTE",7,"Temuco",null,"2021-07-22"]
[null,null,null,null,null,null,null,3875,"MUNOZ INFANTA,MARCO ARIEL",31,"HDI Club",null,"2021-07-23"]
[null,null,null,null,null,null,null,3912,"CARVAJAL WILSON,LINO DOMINGO",2,"Iquique",null,"2021-07-24"]
[null,null,null,null,null,null,null,4003,"URZUA BECERRA,NABOR OSVALDO",7,"Temuco",null,"2021-07-25"]
[null,null,null,null,null,null,null,3815,"INDO PONTIGO,OSCAR",3,"Antofagasta",null,"2021-07-26"]
[null,null,null,null,null,null,null,3702,"CASTRO BORQUEZ,ORESTES",7,"Temuco",null,"2021-07-27"]
[null,null,null,null,null,null,null,3422,"BERGER PALLOMARI,SERGIO GUILLERMO",3,"Antofagasta",null,"2021-07-28"]
[null,null,null,null,null,null,null,3887,"LYON OSSA,BARBARA",1,"Advance"]
[null,null,null,null,null,null,null,4084,"SAAVEDRA RODRIGUEZ,ERNESTO PATRICIO",15,"HDI Santiago"]
[null,null,null,null,null,null,null,3512,"HABERT CARRILLO,WALTER NELSON",7,"Temuco"]
[null,null,null,null,null,null,null,4297,"VELASQUEZ SALAH,GUSTAVO ALFONSO",31,"HDI Club"]
[null,null,null,null,null,null,null,3165,"SEPULVEDA MOYA,MANUEL GONZALO",4,"Viña del Mar"]
[null,null,null,null,null,null,null,3834,"GUAMAN CESPEDES,ANTONIO",3,"Antofagasta"]
[null,null,null,null,null,null,null,3807,"VASQUEZ ECHEVERRIA,ADRIANA ISABEL",4,"Viña del Mar"]
[null,null,null,null,null,null,null,3902,"PINCHEIRA SOTO,ARNALDO ALFONSO",7,"Temuco"]
[null,null,null,null,null,null,null,3831,"NUALART GONZALEZ,CARMEN MARIA ALEJAN",7,"Temuco"]
[null,null,null,null,null,null,null,4338,"JIMENEZ MARTIN,ANSELMO",7,"Temuco"]
[null,null,null,null,null,null,null,4002,"BARRENECHEA BARRIA,SANDRA ROSALBA",7,"Temuco"]
[null,null,null,null,null,null,null,3301,"MANTEROLA VALDES,JAIME ANDRES",15,"HDI Santiago"]
[null,null,null,null,null,null,null,4007,"MARTINEZ ASSMANN,SARA TERESA DE LOUR",15,"HDI Santiago"]
[null,null,null,null,null,null,null,4249,"VALDES MILLAN,SERGIO MANUEL",15,"HDI Santiago"]
[null,null,null,null,null,null,null,3728,"SILVA CHACON,NORMA ELENA",2,"Iquique"]
[null,null,null,null,null,null,null,4092,"HEVIA ALZERRECA,GLORIA MARISOL",31,"HDI Club"]
[null,null,null,null,null,null,null,3586,"FARIAS SALINAS,ALEJANDRA TEAMAR",3,"Antofagasta"]
[null,null,null,null,null,null,null,3243,"CASTELLANO BAHAMONDES,JOSE IGNACIO",31,"HDI Club"]
[null,null,null,null,null,null,null,4227,"DATTWYLER VIDAURRE,GLORIA ANGELICA",4,"Viña del Mar"]
[null,null,null,null,null,null,null,4061,"CORTES TORO,ROLANDO ALIRO",17,"La Serena"]
[null,null,null,null,null,null,null,4068,"CONTRERAS PEREZ,NELLA LUISA",15,"HDI Santiago"]
{"$rows_left_out":2072}
{"sheet":"Validaciones","index":3,"n_rows":40,"n_cols":14,"rows_kept":40,"cut":false,"hidden":true,"merged":[]}
[null,"Campo","Valores"]
[]
[]
["1.","DIA DE VENCIMIENTO",5]
[null,null,10]
[null,null,15]
[null,null,20]
[null,null,25]
[]
[]
[2,"Tipo facturacion","SIN FACTURA"]
[null,null,"FACTURA POST-PAGO"]
[null,null,"FACTURA PRE-PAGO"]
[]
[]
[3,"Forma de pago","PAC"]
[null,null,"TARJETA"]
[null,null,"BOLETIN"]
[null,null,"DESC% POR PLANILLA"]
[null,null,"PRE-PAGO"]
[4,"Tipo persona","Natural"]
[null,null,"Jurídica"]
[5,"Sexo","Masculino"]
[null,null,"Femenino"]
[6,"Grupo etario",18,49,"Grupo 1"]
[null,null,50,59,"Grupo 2"]
[null,null,60,69,"Grupo 3"]
[]
[null,null,"Comision de acuerdo a selección prima",null,null,null,null,null,null,"Limites",null,"% com"]
["Validador",{"$f":"Solicitud!E35*(1-Solicitud!#REF!)","v":{"$error":"#REF!"}},{"$f":"ROUND((Solicitud!E35/K30),2)-1+10%","v":-0.9},null,null,0.42,0.05,null,null,"P maxima",0.42,0]
[null,{"$f":"B30*1.1","v":{"$error":"#REF!"}},{"$f":"IF(C30>10%,10%,C30)","v":-0.9},"Comision a usar de acuerdo prima",null,{"$f":"F30*0.95","v":0.39899999999999997},null,null,null,"Pmin",{"$f":"K30*0.9","v":0.378},10,"debe ser 10 comision"]
[]
[]
["Vigencia maxima desde cotizacion",null,"Dias cot vs Días hoy","Días Limite",null,null,null,null,null,null,null,0.56999999999999995,{"$f":"1-L34","v":0.43000000000000005}]
[null,"Fecha hoy",{"$f":"(Solicitud!E31-TODAY())","v":-44357},10,null,null,null,null,null,null,null,"Hospitalizacion","Muerte"]
[null,null,null,null,null,null,null,null,null,"Prima de Riesgo",0.25,{"$f":"ROUND(K36*L34,3)","v":0.14299999999999999},{"$f":"K36-L36","v":0.10700000000000001},{"$f":"K36-L36-M36","v":0}]
[null,null,null,null,null,null,null,null,0.15,"Gastos",{"$f":"ROUND(K$36/(1-SUM($I$37:$I$39))*$I37,3)","v":5.8000000000000003E-2},{"$f":"ROUND(L$36/(1-SUM($I$37:$I$39))*$I37,3)","v":3.3000000000000002E-2},2.5000000000000001E-2,{"$f":"K37-L37-M37","v":0}]
[null,null,null,null,null,null,null,null,0.20399999999999999,"Margen",{"$f":"ROUND(K$36/(1-SUM($I$37:$I$39))*$I38,3)","v":7.9000000000000001E-2},4.4999999999999998E-2,{"$f":"ROUND(M$36/(1-SUM($I$37:$I$39))*$I38,3)","v":3.4000000000000002E-2},{"$f":"K38-L38-M38","v":0}]
[null,null,null,null,null,null,null,null,0,"Comision",{"$f":"ROUND(K$36/(1-SUM($I$37:$I$39))*$I39,3)","v":0},0,0,{"$f":"K39-L39-M39","v":0}]
[null,null,null,null,null,null,null,null,null,"Prima Neta",{"$f":"SUM(K36:K39)","v":0.38700000000000001},{"$f":"SUM(L36:L39)","v":0.22099999999999997},0.16600000000000001,{"$f":"K40-L40-M40","v":0}]